{"text_format":"1","workbook":"xlsx","n_sheets":16,"sheets":["Notice","PNJ-PJ complet","combat","Dés","aléatoire","base","Résultats","2gX","3gX","4gX","5gX","6gX","7gX","8gX","9gX","10gX"],"not_rendered":{"charts":0,"images":11,"macros":1,"external_links":0,"defined_names":13,"comments":0,"pivot_tables":0},"unopened":[],"bounds":{"document_bytes":16777216,"sheet_cells":100000,"rows_first":2000,"rows_last":500,"rows_between":2000,"halvings":0,"cell_chars":16384,"cell_head_chars":4096},"cells_cut":0,"cells_raw":0,"read":"whole","date_system":"1900"}

{"sheet":"Notice","index":0,"n_rows":34,"n_cols":7,"rows_kept":34,"cut":false,"hidden":false,"merged":[[15,0,15,3],[15,4,15,5],[15,6,15,8]]}
["Bien que le nombre de feuilles de ce classeur peut paraitre impressionnant, il n'en est rien !"]
[]
["SI vous savez vou servir de mes documents \"feuille de PJ/PNJ L5A\" et \"simulateur de jet de dés L5A\" (toutes les 2 disponible sur la scenariothèque cette feuille) ce classeur est juste un combiné des 2."]
[]
["le principe ici est de gérer les jetsde dés des PNJ (ou des PJ pour des tests discret comme par exemple des test de perception ou de vigilance)"]
[]
["il sffit de sélection un jet de dé (2 cellules jointives, le \"G\" peut apparaitre mais ne doit pas être dans une cellule à part entière)"]
[]
["et ensuite de cliquer sur le bouton \"lancer la sélection\" qui est dans la feuille \"combat\""]
[]
["une boite de dialogue va alors apparitre en vous indiquant combien de dés ont été lancés et le résultat du jet"]
[]
["si par exeple vous sélectionner les cellules L26 et M26 et que vous cliquez sur lancer la sélection vous pourrez voir apparaitre une boite de dialogue comme suis  :"]
[]
[]
["Sélection",null,null,null,"clic",null,"Apparition de la boite de dialogue"]
[]
[]
[]
[]
{"$rows_left_out":15}
{"sheet":"PNJ-PJ complet","index":1,"n_rows":62,"n_cols":16,"rows_kept":62,"cut":false,"hidden":false,"merged":[[0,1,0,11],[2,1,2,4],[2,9,2,11],[3,6,3,8],[3,10,3,11],[8,2,9,2],[8,10,8,11],[9,10,9,11],[10,1,11,1],[10,2,11,2],[10,10,10,11],[11,10,11,11],[4,1,5,1],[4,2,5,2],[4,7,11,8],[4,10,4,11],[5,10,5,11],[6,1,7,1],[6,2,7,2],[6,10,6,11],[7,10,7,11],[8,1,9,1],[16,1,16,3],[16,5,16,9],[16,10,16,11],[17,1,17,11],[12,1,12,11],[13,1,13,2],[13,8,13,11],[14,1,14,11],[15,1,15,3],[15,6,15,7],[15,8,15,9],[15,10,15,11],[23,1,23,2],[24,1,24,2],[25,1,25,4],[25,8,25,9],[25,10,25,11],[26,1,26,4],[19,2,19,3],[20,2,20,3],[20,4,20,5],[20,6,20,8],[21,1,21,11],[22,1,22,2],[22,4,22,5],[22,6,22,8],[22,9,22,11],[33,1,33,4],[34,1,34,4],[35,1,35,4],[36,1,36,4],[37,1,37,4],[38,1,38,4],[27,1,27,4],[28,1,28,4],[29,1,29,4],[30,1,30,4],[31,1,31,4],[32,1,32,4],[43,1,43,2],[43,3,43,10],[44,1,44,2],[44,3,44,10],[45,1,45,11],[46,1,46,11],[39,1,39,11],[40,1,40,2],[40,3,40,10],[41,1,41,2],[41,3,41,10],[42,1,42,2],[42,3,42,10],[55,1,55,11],[56,1,56,2],[56,3,56,4],[56,5,56,7],[56,8,56,11],[47,1,47,11],[48,1,48,11],[49,1,49,11],[50,1,50,11],[51,1,51,11],[52,1,52,11],[61,1,61,11],[62,1,66,11],[1,6,1,11],[1,1,1,5],[18,5,18,6],[18,7,18,8],[59,1,59,2],[59,3,59,4],[59,5,59,7],[59,8,59,11],[60,1,60,2],[60,3,60,4],[60,5,60,7],[60,8,60,11],[57,1,57,2],[57,3,57,4],[57,5,57,7],[57,8,57,11],[58,1,58,2],[58,3,58,4],[58,5,58,7],[58,8,58,11],[53,1,53,11],[54,1,54,11]]}
[null,"NOM & CLAN"]
[null,"Famille XXX",null,null,null,null,"Ecole XXX"]
[null,"Anneaux :",null,null,null,"Rang de blessures",null,null,null,"Dmg subis"]
[null,"Vide",null,"Vide",2,"Actuel",{"$f":"IF(H5<=G5,F5,IF(H5<=G6,F6,IF(H5<=G7,F7,IF(H5<=G8,F8,IF(H5<=G9,F9,IF(H5<=G10,F10,IF(H5<=G11,F11,IF(H5<=G12,F12,\"test\"))))))))","v":"DD + 0"},null,null,{"$f":"IF(L4=0,0,L4-$K$17)","v":0}]
[null,"Air",{"$f":"MIN(E5:E6)","v":2},"Intuition",2,"DD + 0",{"$f":"C11*5","v":15},{"$f":"SUM(J4:J12)","v":0},null,0]
[null,null,null,"Réflexes",3,"DD + 3",{"$f":"($C$11*2)+G5","v":21},null,null,0]
[null,"Feu",{"$f":"MIN(E7:E8)","v":2},"Intelligence",2,"DD + 5",27,null,null,0]
[null,null,null,"Agilité",4,"DD + 10",33,null,null,0]
[null,"Eau",{"$f":"MIN(E9:E10)","v":3},"Constitution",3,"DD + 15",39,null,null,0]
[null,null,null,"Volonté",3,"DD + 20",45,null,null,0]
[null,"terre",{"$f":"MIN(E11:E12)","v":3},"Force",3,"DD + 40",51,null,null,0]
[null,null,null,"Perception",4,"Hors Combat",57,null,null,0,null,null,null,"zone à modifier"]
[null,"Statut : (Anneaux X 10, + Compétences + Bonus)",null,null,null,null,null,null,null,null,null,null,null,1,{"$f":"N13*5","v":5},{"$f":"O13*10","v":50}]
[null,{"$f":"((SUM(C5:C12))*10)+SUM(G27:G39)","v":127},null," Bonus",0,"Total",{"$f":"E14+B14","v":127},null,null,null,null,null,null,1,{"$f":"N14/5","v":0.2},{"$f":"N14*10","v":10}]
[null,"Classe d'armure :",null,null,null,null,null,null,null,null,null,null,null,50,{"$f":"N15/10","v":5},{"$f":"O15/5","v":1}]
[null,"Base CA (5 X Réflexes + 5)",null,null,{"$f":"(E8*5)+5","v":25},"Armure",null,null,"Guérison",null,{"$f":"C11*2","v":6}]
[null,"Base CA + Armure + Divers",null,null,{"$f":"E16+G16","v":25},"Réduction des dégats",null,null,null,null,2]
[null,"Initiative : (Statut / Réflexes)"]
[null,{"$f":"I14+E8","v":4},{"$f":"E8","v":4},"Bonus divers",0,"résultat dé",null,14,null,"Init.Actuel",null,{"$f":"H19+E19","v":14}]
[null,"Honneur : ","argent"]
{"$rows_left_out":43}
{"sheet":"combat","index":2,"n_rows":38,"n_cols":49,"rows_kept":38,"cut":false,"hidden":false,"merged":[[39,38,39,39],[39,40,39,41],[39,42,39,44],[39,45,39,48],[31,38,31,48],[32,38,36,48],[37,38,37,48],[38,38,38,39],[38,40,38,41],[38,42,38,44],[38,45,38,48],[25,38,25,41],[26,38,26,41],[27,38,27,41],[28,38,28,41],[29,38,29,41],[30,38,30,41],[23,38,23,39],[23,43,23,44],[23,47,23,48],[24,38,24,41],[24,45,24,46],[24,47,24,48],[20,38,20,48],[21,38,21,39],[21,41,21,42],[21,43,21,45],[21,46,21,48],[22,38,22,39],[22,43,22,44],[22,47,22,48],[16,38,16,48],[18,39,18,40],[19,39,19,40],[19,41,19,42],[19,43,19,45],[17,42,17,43],[17,44,17,45],[13,38,13,48],[14,38,14,40],[14,43,14,44],[14,45,14,46],[14,47,14,48],[15,38,15,40],[15,42,15,46],[15,47,15,48],[9,38,10,38],[9,39,10,39],[9,47,9,48],[10,47,10,48],[11,38,11,48],[12,38,12,39],[12,45,12,48],[5,38,6,38],[5,39,6,39],[5,47,5,48],[6,47,6,48],[7,38,8,38],[7,39,8,39],[7,47,7,48],[8,47,8,48],[0,38,0,48],[1,38,1,41],[1,46,1,48],[2,43,2,45],[2,47,2,48],[3,38,4,38],[3,39,4,39],[3,44,10,45],[3,47,3,48],[4,47,4,48],[38,26,38,27],[38,28,38,29],[38,30,38,32],[38,33,38,36],[39,26,39,27],[39,28,39,29],[39,30,39,32],[39,33,39,36],[28,26,28,29],[29,26,29,29],[30,26,30,29],[31,26,31,36],[32,26,36,36],[37,26,37,36],[24,26,24,29],[24,33,24,34],[24,35,24,36],[25,26,25,29],[26,26,26,29],[27,26,27,29],[22,26,22,27],[22,31,22,32],[22,35,22,36],[23,26,23,27],[23,31,23,32],[23,35,23,36],[18,27,18,28],[19,27,19,28],[19,29,19,30],[19,31,19,33],[20,26,20,36],[21,26,21,27],[21,29,21,30],[21,31,21,33],[21,34,21,36],[15,26,15,28],[15,30,15,34],[15,35,15,36],[16,26,16,36],[11,26,11,36],[12,26,12,27],[12,33,12,36],[13,26,13,36],[14,26,14,28],[14,31,14,32],[14,33,14,34],[14,35,14,36],[7,35,7,36],[8,35,8,36],[9,26,10,26],[9,27,10,27],[9,35,9,36],[10,35,10,36],[3,27,4,27],[3,32,10,33],[3,35,3,36],[4,35,4,36],[5,26,6,26],[5,27,6,27],[5,35,5,36],[6,35,6,36],[7,26,8,26],[7,27,8,27],[39,14,39,15],[39,16,39,17],[39,18,39,20],[39,21,39,24],[0,26,0,36],[1,26,1,29],[1,34,1,36],[2,31,2,33],[2,35,2,36],[3,26,4,26],[31,14,31,24],[32,14,36,24],[37,14,37,24],[38,14,38,15],[38,16,38,17],[38,18,38,20],[38,21,38,24],[25,14,25,17],[26,14,26,17],[27,14,27,17],[28,14,28,17],[29,14,29,17],[30,14,30,17],[23,14,23,15],[23,19,23,20],[23,23,23,24],[24,14,24,17],[24,21,24,22],[24,23,24,24],[20,14,20,24],[21,14,21,15],[21,17,21,18],[21,19,21,21],[21,22,21,24],[22,14,22,15],[22,19,22,20],[22,23,22,24],[16,14,16,24],[18,15,18,16],[19,15,19,16],[19,17,19,18],[19,19,19,21],[17,18,17,19],[17,20,17,21],[13,14,13,24],[14,14,14,16],[14,19,14,20],[14,21,14,22],[14,23,14,24],[15,14,15,16],[15,18,15,22],[15,23,15,24],[11,14,11,24],[12,14,12,15],[12,21,12,24],[5,14,6,14],[5,15,6,15],[5,23,5,24],[6,23,6,24],[7,14,8,14],[7,15,8,15],[7,23,7,24],[8,23,8,24],[0,14,0,24],[1,14,1,17],[1,22,1,24],[2,19,2,21],[2,23,2,24],[3,14,4,14],[3,15,4,15],[3,20,10,21],[3,23,3,24],[4,23,4,24],[9,14,10,14],[9,15,10,15],[9,23,9,24],[10,23,10,24],[31,2,31,12],[32,2,36,12],[37,2,37,12],[39,2,39,3],[39,4,39,5],[39,6,39,8],[39,9,39,12],[17,30,17,31],[17,32,17,33],[17,6,17,7],[17,8,17,9],[38,2,38,3],[38,4,38,5],[38,6,38,8],[38,9,38,12],[29,2,29,5],[30,2,30,5],[26,2,26,5],[27,2,27,5],[28,2,28,5],[22,2,22,3],[23,2,23,3],[24,2,24,5],[24,9,24,10],[24,11,24,12],[25,2,25,5],[23,7,23,8],[22,7,22,8],[23,11,23,12],[22,11,22,12],[18,3,18,4],[19,3,19,4],[19,5,19,6],[19,7,19,9],[20,2,20,12],[21,2,21,3],[21,5,21,6],[21,7,21,9],[21,10,21,12],[11,2,11,12],[7,2,8,2],[7,3,8,3],[7,11,7,12],[8,11,8,12],[15,2,15,4],[15,6,15,10],[15,11,15,12],[16,2,16,12],[12,2,12,3],[12,9,12,12],[13,2,13,12],[14,2,14,4],[14,7,14,8],[14,9,14,10],[14,11,14,12],[5,2,6,2],[5,3,6,3],[5,11,5,12],[6,11,6,12],[0,2,0,12],[1,2,1,5],[1,10,1,12],[2,7,2,9],[2,11,2,12],[3,2,4,2],[3,3,4,3],[3,8,10,9],[3,11,3,12],[4,11,4,12],[9,2,10,2],[9,3,10,3],[9,11,9,12],[10,11,10,12]]}
["nom PJ/PNJ","Initiative","NOM",null,null,null,null,null,null,null,null,null,null,null,"PNJ 2",null,null,null,null,null,null,null,null,null,null,null,"PNJ 3",null,null,null,null,null,null,null,null,null,null,null,"PNJ 4"]
["PJ4",25,"Anneaux :",null,null,null,"Rang de blessures",null,null,null,"Dmg subis",null,null,null,"Anneaux :",null,null,null,"Rang de blessures",null,null,null,"Dmg subis",null,null,null,"Anneaux :",null,null,null,"Rang de blessures",null,null,null,"Dmg subis",null,null,null,"Anneaux :",null,null,null,"Rang de blessures",null,null,null,"Dmg subis"]
[{"$f":"$O$1","v":"PNJ 2"},{"$f":"$Y$18","v":22},"Vide",null,"Vide",2,"Actuel",{"$f":"IF(I4<=H4,G4,IF(I4<=H5,G5,IF(I4<=H6,G6,IF(I4<=H7,G7,IF(I4<=H8,G8,IF(I4<=H9,G9,IF(I4<=H10,G10,IF(I4<=H11,G11,\"test\"))))))))","v":"DD + 0"},null,null,{"$f":"IF(M3=0,0,M3-$L$16)","v":0},null,null,null,"Vide",null,"Vide",2,"Actuel",{"$f":"IF(U4<=T4,S4,IF(U4<=T5,S5,IF(U4<=T6,S6,IF(U4<=T7,S7,IF(U4<=T8,S8,IF(U4<=T9,S9,IF(U4<=T10,S10,IF(U4<=T11,S11,\"test\"))))))))","v":"DD + 0"},null,null,{"$f":"IF(Y3=0,0,Y3-$L$16)","v":0},null,null,null,"Vide",null,"Vide",2,"Actuel",{"$f":"IF(AG4<=AF4,AE4,IF(AG4<=AF5,AE5,IF(AG4<=AF6,AE6,IF(AG4<=AF7,AE7,IF(AG4<=AF8,AE8,IF(AG4<=AF9,AE9,IF(AG4<=AF10,AE10,IF(AG4<=AF11,AE11,\"test\"))))))))","v":"DD + 0"},null,null,{"$f":"IF(AK3=0,0,AK3-$L$16)","v":0},null,null,null,"Vide",null,"Vide",2,"Actuel",{"$f":"IF(AS4<=AR4,AQ4,IF(AS4<=AR5,AQ5,IF(AS4<=AR6,AQ6,IF(AS4<=AR7,AQ7,IF(AS4<=AR8,AQ8,IF(AS4<=AR9,AQ9,IF(AS4<=AR10,AQ10,IF(AS4<=AR11,AQ11,\"test\"))))))))","v":"DD + 0"},null,null,{"$f":"IF(AW3=0,0,AW3-$L$16)","v":0}]
[{"$f":"$AA$1","v":"PNJ 3"},{"$f":"$AK$18","v":22},"Air",{"$f":"MIN(F4:F5)","v":2},"Intuition",2,"DD + 0",{"$f":"D10*5","v":15},{"$f":"SUM(K3:K11)","v":0},null,0,null,null,null,"Air",{"$f":"MIN(R4:R5)","v":2},"Intuition",2,"DD + 0",{"$f":"P10*5","v":15},{"$f":"SUM(W3:W11)","v":0},null,0,null,null,null,"Air",{"$f":"MIN(AD4:AD5)","v":2},"Intuition",2,"DD + 0",{"$f":"AB10*5","v":15},{"$f":"SUM(AI3:AI11)","v":0},null,0,null,null,null,"Air",{"$f":"MIN(AP4:AP5)","v":2},"Intuition",2,"DD + 0",{"$f":"AN10*5","v":15},{"$f":"SUM(AU3:AU11)","v":0},null,0]
["PJ 1",17,null,null,"Réflexes",3,"DD + 3",{"$f":"($D$10*2)+H4","v":21},null,null,0,null,null,null,null,null,"Réflexes",3,"DD + 3",{"$f":"($D$10*2)+T4","v":21},null,null,0,null,null,null,null,null,"Réflexes",3,"DD + 3",{"$f":"($D$10*2)+AF4","v":21},null,null,0,null,null,null,null,null,"Réflexes",3,"DD + 3",{"$f":"($D$10*2)+AR4","v":21},null,null,0]
[{"$f":"$C$1","v":"NOM"},{"$f":"$M$18","v":14},"Feu",{"$f":"MIN(F6:F7)","v":2},"Intelligence",2,"DD + 5",27,null,null,0,null,null,null,"Feu",{"$f":"MIN(R6:R7)","v":2},"Intelligence",2,"DD + 5",27,null,null,0,null,null,null,"Feu",{"$f":"MIN(AD6:AD7)","v":2},"Intelligence",2,"DD + 5",27,null,null,0,null,null,null,"Feu",{"$f":"MIN(AP6:AP7)","v":2},"Intelligence",2,"DD + 5",27,null,null,0]
["PJ2",13,null,null,"Agilité",4,"DD + 10",33,null,null,0,null,null,null,null,null,"Agilité",4,"DD + 10",33,null,null,0,null,null,null,null,null,"Agilité",4,"DD + 10",33,null,null,0,null,null,null,null,null,"Agilité",4,"DD + 10",33,null,null,0]
[{"$f":"$AM$1","v":"PNJ 4"},{"$f":"$AW$18","v":8},"Eau",{"$f":"MIN(F8:F9)","v":3},"Constitution",3,"DD + 15",39,null,null,0,null,null,null,"Eau",{"$f":"MIN(R8:R9)","v":3},"Constitution",3,"DD + 15",39,null,null,0,null,null,null,"Eau",{"$f":"MIN(AD8:AD9)","v":3},"Constitution",3,"DD + 15",39,null,null,0,null,null,null,"Eau",{"$f":"MIN(AP8:AP9)","v":3},"Constitution",3,"DD + 15",39,null,null,0]
["PJ3",7,null,null,"Volonté",3,"DD + 20",45,null,null,0,null,null,null,null,null,"Volonté",3,"DD + 20",45,null,null,0,null,null,null,null,null,"Volonté",3,"DD + 20",45,null,null,0,null,null,null,null,null,"Volonté",3,"DD + 20",45,null,null,0]
[null,null,"terre",{"$f":"MIN(F10:F11)","v":3},"Force",3,"DD + 40",51,null,null,0,null,null,null,"terre",{"$f":"MIN(R10:R11)","v":3},"Force",3,"DD + 40",51,null,null,0,null,null,null,"terre",{"$f":"MIN(AD10:AD11)","v":3},"Force",3,"DD + 40",51,null,null,0,null,null,null,"terre",{"$f":"MIN(AP10:AP11)","v":3},"Force",3,"DD + 40",51,null,null,0]
[null,null,null,null,"Perception",4,"Hors Combat",57,null,null,0,null,null,null,null,null,"Perception",4,"Hors Combat",57,null,null,0,null,null,null,null,null,"Perception",4,"Hors Combat",57,null,null,0,null,null,null,null,null,"Perception",4,"Hors Combat",57,null,null,0]
[null,null,"Statut : (Anneaux X 10, + Compétences + Bonus)",null,null,null,null,null,null,null,null,null,null,null,"Statut : (Anneaux X 10, + Compétences + Bonus)",null,null,null,null,null,null,null,null,null,null,null,"Statut : (Anneaux X 10, + Compétences + Bonus)",null,null,null,null,null,null,null,null,null,null,null,"Statut : (Anneaux X 10, + Compétences + Bonus)"]
[null,null,{"$f":"((SUM(D4:D11))*10)+SUM(H26:H31)","v":120},null," Bonus",0,"Total",{"$f":"F13+C13","v":120},null,null,null,null,null,null,{"$f":"((SUM(P4:P11))*10)+SUM(T26:T31)","v":120},null," Bonus",0,"Total",{"$f":"R13+O13","v":120},null,null,null,null,null,null,{"$f":"((SUM(AB4:AB11))*10)+SUM(AF26:AF31)","v":120},null," Bonus",0,"Total",{"$f":"AD13+AA13","v":120},null,null,null,null,null,null,{"$f":"((SUM(AN4:AN11))*10)+SUM(AR26:AR31)","v":120},null," Bonus",0,"Total",{"$f":"AP13+AM13","v":120}]
[null,null,"Classe d'armure :",null,null,null,null,null,null,null,null,null,null,null,"Classe d'armure :",null,null,null,null,null,null,null,null,null,null,null,"Classe d'armure :",null,null,null,null,null,null,null,null,null,null,null,"Classe d'armure :"]
[null,null,"Base CA (5 X Réflexes + 5)",null,null,{"$f":"(F7*5)+5","v":25},"Armure",null,null,"Guérison",null,{"$f":"D10*2","v":6},null,null,"Base CA (5 X Réflexes + 5)",null,null,{"$f":"(R7*5)+5","v":25},"Armure",null,null,"Guérison",null,{"$f":"P10*2","v":6},null,null,"Base CA (5 X Réflexes + 5)",null,null,{"$f":"(AD7*5)+5","v":25},"Armure",null,null,"Guérison",null,{"$f":"AB10*2","v":6},null,null,"Base CA (5 X Réflexes + 5)",null,null,{"$f":"(AP7*5)+5","v":25},"Armure",null,null,"Guérison",null,{"$f":"AN10*2","v":6}]
[null,null,"Base CA + Armure + Divers",null,null,{"$f":"F15+H15","v":25},"Réduction des dégats",null,null,null,null,2,null,null,"Base CA + Armure + Divers",null,null,{"$f":"R15+T15","v":25},"Réduction des dégats",null,null,null,null,2,null,null,"Base CA + Armure + Divers",null,null,{"$f":"AD15+AF15","v":25},"Réduction des dégats",null,null,null,null,2,null,null,"Base CA + Armure + Divers",null,null,{"$f":"AP15+AR15","v":25},"Réduction des dégats",null,null,null,null,2]
[null,null,"Initiative : (Statut / Réflexes)",null,null,null,null,null,null,null,null,null,null,null,"Initiative : (Statut / Réflexes)",null,null,null,null,null,null,null,null,null,null,null,"Initiative : (Statut / Réflexes)",null,null,null,null,null,null,null,null,null,null,null,"Initiative : (Statut / Réflexes)"]
[null,null,{"$f":"J13+F7","v":4},{"$f":"F7","v":4},"Bonus divers",0,"résultat dé",null,14,null,"Init.Actuel",null,{"$f":"I18+F18","v":14},null,{"$f":"V13+R7","v":4},{"$f":"R7","v":4},"Bonus divers",0,"résultat dé",null,22,null,"Init.Actuel",null,{"$f":"U18+R18","v":22},null,{"$f":"AH13+AD7","v":4},{"$f":"AD7","v":4},"Bonus divers",0,"résultat dé",null,22,null,"Init.Actuel",null,{"$f":"AG18+AD18","v":22},null,{"$f":"AT13+AP7","v":4},{"$f":"AP7","v":4},"Bonus divers",0,"résultat dé",null,8,null,"Init.Actuel",null,{"$f":"AS18+AP18","v":8}]
[null,null,"Honneur : ","argent",null,null,null,null,null,null,null,null,null,null,"Honneur : ","argent",null,null,null,null,null,null,null,null,null,null,"Honneur : ","argent",null,null,null,null,null,null,null,null,null,null,"Honneur : ","argent"]
[null,null,4.5,5,null,2,null,2,null,null,null,null,null,null,4.5,5,null,2,null,2,null,null,null,null,null,null,4.5,5,null,2,null,2,null,null,null,null,null,null,4.5,5,null,2,null,2]
{"$rows_left_out":19}
{"sheet":"Dés","index":3,"n_rows":14,"n_cols":16,"rows_kept":14,"cut":false,"hidden":false,"merged":[[0,13,0,15],[11,5,13,11],[9,5,10,11],[0,0,0,1]]}
["X    G    X",null,null,null,null,null,"Dé réels",{"$f":"A7","v":10},"g",{"$f":"B7","v":3},"+",{"$f":"C6","v":0},null,"recherche du résultat"]
[12,2,null,null,null,null,null,null,null,null,null,null,null,null,"résultat du dé","Dé + bonus (si >10g10)"]
[{"$f":"A2-10","v":2},null,null,null,null,null,null,null,null,null,null,null,null,{"$f":"CONCATENATE($H$1,$I$1,$J$1)","v":"10g3"},{"$f":"IF(ISNA(HLOOKUP(N3,Résultats!A1:J2,2,0)),0,HLOOKUP(N3,Résultats!A1:J2,2,0))","v":0},{"$f":"O3+$L$1","v":0}]
[{"$f":"IF(A3<0,0,A3)","v":2},{"$f":"ROUNDDOWN(B2+(A4/2),0)","v":3},null,null,null,null,null,null,null,null,null,null,null,{"$f":"CONCATENATE($H$1,$I$1,$J$1)","v":"10g3"},{"$f":"IF(ISNA(HLOOKUP(N4,Résultats!A3:J4,2,0)),0,HLOOKUP(N4,Résultats!A3:J4,2,0))","v":0},{"$f":"O4+$L$1","v":0}]
[null,{"$f":"B4-10","v":-7},null,null,null,null,null,null,null,null,null,null,null,"10g3",{"$f":"IF(ISNA(HLOOKUP(N5,Résultats!A5:J6,2,0)),0,HLOOKUP(N5,Résultats!A5:J6,2,0))","v":26},26]
[null,{"$f":"IF(B5<0,0,ROUNDDOWN(B5,0))","v":0},{"$f":"B6*2","v":0},null,null,null,null,null,null,null,null,null,null,"10g3",{"$f":"IF(ISNA(HLOOKUP(N6,Résultats!A7:J8,2,0)),0,HLOOKUP(N6,Résultats!A7:J8,2,0))","v":0},0]
[{"$f":"IF(A2>10,10,A2)","v":10},{"$f":"IF(B4>10,10,B4)","v":3},null,null,null,null,null,null,null,null,null,null,null,"10g3",{"$f":"IF(ISNA(HLOOKUP(N7,Résultats!A9:J10,2,0)),0,HLOOKUP(N7,Résultats!A9:J10,2,0))","v":0},0]
[null,null,null,null,null,null,null,null,null,null,null,null,null,"10g3",{"$f":"IF(ISNA(HLOOKUP(N8,Résultats!A11:J12,2,0)),0,HLOOKUP(N8,Résultats!A11:J12,2,0))","v":0},0]
[null,null,null,null,null,null,null,null,null,null,null,null,null,"10g3",{"$f":"IF(ISNA(HLOOKUP(N9,Résultats!A13:J14,2,0)),0,HLOOKUP(N9,Résultats!A13:J14,2,0))","v":0},0]
[null,null,null,null,null,"Résultat :",null,null,null,null,null,null,null,"10g3",{"$f":"IF(ISNA(HLOOKUP(N10,Résultats!A15:J16,2,0)),0,HLOOKUP(N10,Résultats!A15:J16,2,0))","v":0},0]
[null,null,null,null,null,null,null,null,null,null,null,null,null,"10g3",{"$f":"IF(ISNA(HLOOKUP(N11,Résultats!A17:J18,2,0)),0,HLOOKUP(N11,Résultats!A17:J18,2,0))","v":0},0]
[null,null,null,null,null,{"$f":"P14","v":26},null,null,null,null,null,null,null,"10g3",{"$f":"IF(ISNA(HLOOKUP(N12,Résultats!A19:J20,2,0)),0,HLOOKUP(N12,Résultats!A19:J20,2,0))","v":0},0]
[]
[null,null,null,null,null,null,null,null,null,null,null,null,"somme","10g3",{"$f":"SUM(O3:O12)","v":26},{"$f":"SUM(P3:P12)","v":26}]

{"sheet":"aléatoire","index":4,"n_rows":11,"n_cols":6,"rows_kept":11,"cut":false,"hidden":false,"merged":[]}
[null,"jet","expl1","expl2","expl3","somme"]
[1,{"$f":"RANDBETWEEN(1,10)","v":5},{"$f":"IF(B2=10,RANDBETWEEN(1,10),0)","v":0},0,0,{"$f":"SUM(B2:E2)","v":5}]
[2,7,0,0,0,7]
[3,10,9,0,0,19]
[4,3,0,0,0,3]
[5,9,0,0,0,9]
[6,4,0,0,0,4]
[7,5,0,0,0,5]
[8,7,0,0,0,7]
[9,6,0,0,0,6]
[10,2,0,0,0,2]

{"sheet":"base","index":5,"n_rows":11,"n_cols":1,"rows_kept":11,"cut":false,"hidden":false,"merged":[]}
["base"]
[1]
[9]
[8]
[4]
[9]
[1]
[1]
[3]
[2]
[7]

{"sheet":"Résultats","index":6,"n_rows":20,"n_cols":11,"rows_kept":20,"cut":false,"hidden":false,"merged":[]}
["1g1","2g1","3g1","4g1","5g1","6g1","7g1","8g1","9g1","10g1"]
[{"$f":"base!A2","v":1},{"$f":"MAX(base!A2:A3)","v":9},{"$f":"MAX(base!$A$2:$A$4)","v":9},{"$f":"MAX(base!$A$2:$A$5)","v":9},{"$f":"MAX(base!$A$2:$A$6)","v":9},{"$f":"MAX(base!$A$2:$A$7)","v":9},{"$f":"MAX(base!$A$2:$A$8)","v":9},{"$f":"MAX(base!$A$2:$A$9)","v":9},{"$f":"MAX(base!$A$2:$A$10)","v":9},{"$f":"MAX(base!$A$2:$A$11)","v":9}]
[null,"2g2","3g2","4g2","5g2","6g2","7g2","8g2","9g2","10g2"]
[null,{"$f":"SUM(base!$A$2:$A3)","v":10},{"$f":"SUM('3gX'!$A$2:$A$3)","v":17},{"$f":"SUM('4gX'!$A$2:$A$3)","v":17},{"$f":"SUM('5gX'!$A$2:$A$3)","v":18},{"$f":"SUM('6gX'!$A$2:$A$3)","v":18},{"$f":"SUM('7gX'!$A$2:$A$3)","v":18},{"$f":"SUM('8gX'!$A$2:$A$3)","v":18},{"$f":"SUM('9gX'!$A$2:$A$3)","v":18},{"$f":"SUM('10gX'!$A$2:$A$3)","v":18}]
[null,null,"3g3","4g3","5g3","6g3","7g3","8g3","9g3","10g3"]
[null,null,{"$f":"SUM(base!$A$2:$A4)","v":18},{"$f":"SUM('4gX'!$A$2:$A$4)","v":21},{"$f":"SUM('5gX'!$A$2:$A$4)","v":26},{"$f":"SUM('6gX'!$A$2:$A$4)","v":26},{"$f":"SUM('7gX'!$A$2:$A$4)","v":26},{"$f":"SUM('8gX'!$A$2:$A$4)","v":26},{"$f":"SUM('9gX'!$A$2:$A$4)","v":26},{"$f":"SUM('10gX'!$A$2:$A$4)","v":26}]
[null,null,null,"4g4","5g4","6g4","7g4","8g4","9g4","10g4"]
[null,null,null,{"$f":"SUM(base!$A$2:$A5)","v":22},{"$f":"SUM('5gX'!$A$2:$A$5)","v":30},{"$f":"SUM('6gX'!$A$2:$A$5)","v":30},{"$f":"SUM('7gX'!$A$2:$A$5)","v":30},{"$f":"SUM('8gX'!$A$2:$A$5)","v":30},{"$f":"SUM('9gX'!$A$2:$A$5)","v":30},{"$f":"SUM('10gX'!$A$2:$A$5)","v":33}]
[null,null,null,null,"5g5","6g5","7g5","8g5","9g5","10g5"]
[null,null,null,null,{"$f":"SUM(base!$A$2:$A6)","v":31},{"$f":"SUM('6gX'!$A$2:$A$6)","v":31},{"$f":"SUM('7gX'!$A$2:$A$6)","v":31},{"$f":"SUM('8gX'!$A$2:$A$6)","v":33},{"$f":"SUM('9gX'!$A$2:$A$6)","v":33},{"$f":"SUM('10gX'!$A$2:$A$6)","v":37}]
[null,null,null,null,null,"6g6","7g6","8g6","9g6","10g6"]
[null,null,null,null,null,{"$f":"SUM(base!$A$2:$A7)","v":32},{"$f":"SUM('7gX'!$A$2:$A$7)","v":32},{"$f":"SUM('8gX'!$A$2:$A$7)","v":34},{"$f":"SUM('9gX'!$A$2:$A$7)","v":35},{"$f":"SUM('10gX'!$A$2:$A$7)","v":40}]
[null,null,null,null,null,null,"7g7","8g7","9g7","10g7"]
[null,null,null,null,null,null,{"$f":"SUM(base!$A$2:$A8)","v":33},{"$f":"SUM('8gX'!$A$2:$A$8)","v":35},{"$f":"SUM('9gX'!$A$2:$A$8)","v":36},{"$f":"SUM('10gX'!$A$2:$A$8)","v":42}]
[null,null,null,null,null,null,null,"8g8","9g8","10g8"]
[null,null,null,null,null,null,null,{"$f":"SUM(base!$A$2:$A9)","v":36},{"$f":"SUM('9gX'!$A$2:$A$9)","v":37},{"$f":"SUM('10gX'!$A$2:$A$9)","v":43}]
[null,null,null,null,null,null,null,null,"9g9","10g9"]
[null,null,null,null,null,null,null,null,{"$f":"SUM(base!$A$2:$A10)","v":38},{"$f":"SUM('10gX'!$A$2:$A$10)","v":44}]
[null,null,null,null,null,null,null,null,null,"10g10","10g10+"]
[null,null,null,null,null,null,null,null,null,{"$f":"SUM(base!$A$2:$A11)","v":45},{"$f":"J20+Dés!L1","v":45}]
{"$rows_left_out":1}
{"sheet":"2gX","index":7,"n_rows":3,"n_cols":1,"rows_kept":3,"cut":false,"hidden":false,"merged":[]}
["Base g2"]
[{"$f":"base!$A3","v":9}]
[{"$f":"base!$A2","v":1}]

{"sheet":"3gX","index":8,"n_rows":4,"n_cols":1,"rows_kept":4,"cut":false,"hidden":false,"merged":[]}
["Base g3"]
[{"$f":"base!$A3","v":9}]
[{"$f":"base!$A4","v":8}]
[{"$f":"base!$A2","v":1}]

{"sheet":"4gX","index":9,"n_rows":5,"n_cols":1,"rows_kept":5,"cut":false,"hidden":false,"merged":[]}
["Base g4"]
[{"$f":"base!$A3","v":9}]
[{"$f":"base!$A4","v":8}]
[{"$f":"base!$A5","v":4}]
[{"$f":"base!$A2","v":1}]

{"sheet":"5gX","index":10,"n_rows":6,"n_cols":1,"rows_kept":6,"cut":false,"hidden":false,"merged":[]}
["Base g5"]
[{"$f":"base!$A6","v":9}]
[{"$f":"base!$A3","v":9}]
[{"$f":"base!$A4","v":8}]
[{"$f":"base!$A5","v":4}]
[{"$f":"base!$A2","v":1}]

{"sheet":"6gX","index":11,"n_rows":7,"n_cols":1,"rows_kept":7,"cut":false,"hidden":false,"merged":[]}
["Base g6"]
[{"$f":"base!$A6","v":9}]
[{"$f":"base!$A3","v":9}]
[{"$f":"base!$A4","v":8}]
[{"$f":"base!$A5","v":4}]
[{"$f":"base!$A2","v":1}]
[{"$f":"base!$A7","v":1}]

{"sheet":"7gX","index":12,"n_rows":8,"n_cols":1,"rows_kept":8,"cut":false,"hidden":false,"merged":[]}
["Base g7"]
[{"$f":"base!$A6","v":9}]
[{"$f":"base!$A3","v":9}]
[{"$f":"base!$A4","v":8}]
[{"$f":"base!$A5","v":4}]
[{"$f":"base!$A2","v":1}]
[{"$f":"base!$A7","v":1}]
[{"$f":"base!$A8","v":1}]

{"sheet":"8gX","index":13,"n_rows":9,"n_cols":1,"rows_kept":9,"cut":false,"hidden":false,"merged":[]}
["Base g8"]
[{"$f":"base!$A6","v":9}]
[{"$f":"base!$A3","v":9}]
[{"$f":"base!$A4","v":8}]
[{"$f":"base!$A5","v":4}]
[{"$f":"base!$A9","v":3}]
[{"$f":"base!$A2","v":1}]
[{"$f":"base!$A7","v":1}]
[{"$f":"base!$A8","v":1}]

{"sheet":"9gX","index":14,"n_rows":10,"n_cols":1,"rows_kept":10,"cut":false,"hidden":false,"merged":[]}
["Base g9"]
[{"$f":"base!$A6","v":9}]
[{"$f":"base!$A3","v":9}]
[{"$f":"base!$A4","v":8}]
[{"$f":"base!$A5","v":4}]
[{"$f":"base!$A9","v":3}]
[{"$f":"base!$A10","v":2}]
[{"$f":"base!$A2","v":1}]
[{"$f":"base!$A7","v":1}]
[{"$f":"base!$A8","v":1}]

{"sheet":"10gX","index":15,"n_rows":11,"n_cols":1,"rows_kept":11,"cut":false,"hidden":false,"merged":[]}
["Base g10"]
[{"$f":"base!$A6","v":9}]
[{"$f":"base!$A3","v":9}]
[{"$f":"base!$A4","v":8}]
[{"$f":"base!$A11","v":7}]
[{"$f":"base!$A5","v":4}]
[{"$f":"base!$A9","v":3}]
[{"$f":"base!$A10","v":2}]
[{"$f":"base!$A2","v":1}]
[{"$f":"base!$A7","v":1}]
[{"$f":"base!$A8","v":1}]